Reaction Details
Target5-hydroxytryptamine receptor 2A
LigandBDBM50086071
Substrate/Competitorn/a
Meas. Tech.ChEMBL_2527 (CHEMBL616877)
Ki 794±n/a nM
Citation Bromidge, SMDabbs, SDavies, DTDavies, SDuckworth, DMForbes, ITGaster, LMHam, PJones, GEKing, FDMulholland, KRSaunders, DVWyman, PABlaney, FEClarke, SEBlackburn, TPHolland, VKennett, GALightowler, SMiddlemiss, DNTrail, BRiley, GJWood, MD Biarylcarbamoylindolines are novel and selective 5-HT(2C) receptor inverse agonists: identification of 5-methyl-1-[[2-[(2-methyl-3-pyridyl)oxy]- 5-pyridyl]carbamoyl]-6-trifluoromethylindoline (SB-243213) as a potential antidepressant/anxiolytic agent. J Med Chem43:1123-34 (2000) 5-hydroxytryptamine receptor 2A
Name:5-hydroxytryptamine receptor 2A
Type:undefined
Mol. Mass.:52607.65
Organism:Homo sapiens (Human)
Description:P28223
Residue:471
BDBM50086071
NameBDBM50086071
Synonyms:5-Methoxy-6-trifluoromethyl-2,3-dihydro-indole-1-carboxylic acid [6-(2-methyl-pyridin-3-yloxy)-pyridin-3-yl]-amide | CHEMBL14374
TypeSmall organic molecule
Emp. Form.C22H19F3N4O3
Mol. Mass.444.4065
SMILESCOc1cc2CCN(C(=O)Nc3ccc(Oc4cccnc4C)nc3)c2cc1C(F)(F)F