Reaction Details
TargetCytochrome P450 1A2
LigandBDBM50086051
Substrate/Competitorn/a
Meas. Tech.ChEMBL_51356 (CHEMBL666157)
IC50 4000±n/a nM
Citation Bromidge, SMDabbs, SDavies, DTDavies, SDuckworth, DMForbes, ITGaster, LMHam, PJones, GEKing, FDMulholland, KRSaunders, DVWyman, PABlaney, FEClarke, SEBlackburn, TPHolland, VKennett, GALightowler, SMiddlemiss, DNTrail, BRiley, GJWood, MD Biarylcarbamoylindolines are novel and selective 5-HT(2C) receptor inverse agonists: identification of 5-methyl-1-[[2-[(2-methyl-3-pyridyl)oxy]- 5-pyridyl]carbamoyl]-6-trifluoromethylindoline (SB-243213) as a potential antidepressant/anxiolytic agent. J Med Chem43:1123-34 (2000) Cytochrome P450 1A2
Name:Cytochrome P450 1A2
Type:Enzyme
Mol. Mass.:58423.38
Organism:Homo sapiens (Human)
Description:P05177
Residue:516
BDBM50086051
NameBDBM50086051
Synonyms:5-Methoxy-6-trifluoromethyl-2,3-dihydro-indole-1-carboxylic acid (3-pyridin-3-yl-phenyl)-amide | CHEMBL14255
TypeSmall organic molecule
Emp. Form.C22H18F3N3O2
Mol. Mass.413.3924
SMILESCOc1cc2CCN(C(=O)Nc3cccc(c3)-c3cccnc3)c2cc1C(F)(F)F