Reaction Details
Target5-hydroxytryptamine receptor 2B
LigandBDBM50086063
Substrate/Competitorn/a
Meas. Tech.ChEMBL_2877 (CHEMBL617780)
Ki 4±n/a nM
Citation Bromidge, SMDabbs, SDavies, DTDavies, SDuckworth, DMForbes, ITGaster, LMHam, PJones, GEKing, FDMulholland, KRSaunders, DVWyman, PABlaney, FEClarke, SEBlackburn, TPHolland, VKennett, GALightowler, SMiddlemiss, DNTrail, BRiley, GJWood, MD Biarylcarbamoylindolines are novel and selective 5-HT(2C) receptor inverse agonists: identification of 5-methyl-1-[[2-[(2-methyl-3-pyridyl)oxy]- 5-pyridyl]carbamoyl]-6-trifluoromethylindoline (SB-243213) as a potential antidepressant/anxiolytic agent. J Med Chem43:1123-34 (2000) 5-hydroxytryptamine receptor 2B
Name:5-hydroxytryptamine receptor 2B
Type:G Protein-Coupled Receptor (GPCR)
Mol. Mass.:54312.47
Organism:Homo sapiens (Human)
Description:Receptor binding assays were performed using human clone stably expressed in CHO cells.
Residue:481
BDBM50086063
NameBDBM50086063
Synonyms:5-Methoxy-6-trifluoromethyl-2,3-dihydro-indole-1-carboxylic acid [4-methyl-3-(4-methyl-pyridin-3-yl)-phenyl]-amide | CHEMBL14111
TypeSmall organic molecule
Emp. Form.C24H22F3N3O2
Mol. Mass.441.4456
SMILESCOc1cc2CCN(C(=O)Nc3ccc(C)c(c3)-c3cnccc3C)c2cc1C(F)(F)F