Reaction Details
Target5-hydroxytryptamine receptor 1A
LigandBDBM50086851
Substrate/Competitorn/a
Meas. Tech.ChEBML_1229
Ki 24±n/a nM
Citation Fujio, MTogo, YTomozane, HKuroita, TMorio, YKatayama, JMatsumoto, Y N-[[1-(2-phenylethyl)pyrrolidin-2-yl]methyl]cyclohexanecarboxamides as selective 5-HT1A receptor agonists. Bioorg Med Chem Lett10:509-12 (2000) 5-hydroxytryptamine receptor 1A
Name:5-hydroxytryptamine receptor 1A
Type:G Protein-Coupled Receptor (GPCR)
Mol. Mass.:46445.29
Organism:Rattus norvegicus (rat)
Description:Binding assays were performed using rat hippocampal membranes.
Residue:422
BDBM50086851
NameBDBM50086851
Synonyms:2-Methoxy-5-methylsulfanyl-N-((S)-1-phenethyl-pyrrolidin-2-ylmethyl)-benzamide | CHEMBL356945
TypeSmall organic molecule
Emp. Form.C22H28N2O2S
Mol. Mass.384.535
SMILESCOc1ccc(SC)cc1C(=O)NC[C@@H]1CCCN1CCc1ccccc1