Reaction Details
TargetSerotonin 2 (5-HT2) receptor
LigandBDBM50086857
Substrate/Competitorn/a
Meas. Tech.ChEMBL_2334 (CHEMBL617541)
Ki 430±n/a nM
Citation Fujio, MTogo, YTomozane, HKuroita, TMorio, YKatayama, JMatsumoto, Y N-[[1-(2-phenylethyl)pyrrolidin-2-yl]methyl]cyclohexanecarboxamides as selective 5-HT1A receptor agonists. Bioorg Med Chem Lett10:509-12 (2000) Serotonin 2 (5-HT2) receptor
Name:Serotonin 2 (5-HT2) receptor
Synonyms:5-hydroxytryptamine receptor 2A/2B/2C
Type:n/a
Mol. Mass.:n/a
Description:ASSAY_ID of ChEMBL is 2197419
Components:This complex has 3 components.
Component 1
Name:5-hydroxytryptamine receptor 2B
Type:Enzyme Catalytic Domain
Mol. Mass.:53668.47
Organism:RAT
Description:5-HT2B HTR2B RAT::P30994
Residue:479
Component 2
Name:5-hydroxytryptamine receptor 2C
Synonyms:5-HT2C 5-hydroxytryptamine receptor 2C (5HT2c) 5ht1c Htr2c Serotonin receptor 2a and 2c (5HT2A and 5HT2C)
Type:Enzyme
Mol. Mass.:51935.10
Organism:Rattus norvegicus (Rat)
Description:P08909
Residue:460
Component 3
Name:5-hydroxytryptamine receptor 2A
Synonyms:5-HT-2A 5-HT2A 5-hydroxytryptamine receptor 2A (5HT2A) Htr2 Serotonin Receptor 2A
Type:G Protein-Coupled Receptor (GPCR)
Mol. Mass.:52852.05
Organism:Rattus norvegicus (rat)
Description:Rat cortex membranes 5-HT2A receptors.
Residue:471
BDBM50086857
NameBDBM50086857
Synonyms:5-Methylsulfanyl-2,3-dihydro-benzofuran-7-carboxylic acid ((R)-1-phenethyl-pyrrolidin-2-ylmethyl)-amide | CHEMBL149723
TypeSmall organic molecule
Emp. Form.C23H28N2O2S
Mol. Mass.396.546
SMILESCSc1cc2CCOc2c(c1)C(=O)NC[C@H]1CCCN1CCc1ccccc1