Reaction Details
TargetAlpha-2A adrenergic receptor [16-465]
LigandBDBM50085676
Substrate/Competitorn/a
Meas. Tech.ChEMBL_33684 (CHEMBL647841)
Ki 2.9±n/a nM
Citation Ross, TMJetter, MCMcDonnell, MEBoyd, REConnelly, CDMartinez, RPLewis, MACodd, EERaffa, RBReitz, AB Alpha(2) adrenoceptor agonists as potential analgesic agents. 2. Discovery of 4-(4-imidazo)-1,3-dimethyl-6,7-dihydro-thianaphthene as a high-affinity ligand for the alpha(2D) adrenergic receptor. J Med Chem43:1423-6 (2001) Alpha-2A adrenergic receptor [16-465]
Name:Alpha-2A adrenergic receptor [16-465]
Type:G-protein coupled receptor
Mol. Mass.:48961.69
Organism:Rattus norvegicus (rat)
Description:P22909[16-465]
Residue:450
BDBM50085676
NameBDBM50085676
Synonyms:4-(1,3-Dimethyl-4,5,6,7-tetrahydro-benzo[c]thiophen-4-yl)-1H-imidazole | CHEMBL30739
TypeSmall organic molecule
Emp. Form.C13H16N2S
Mol. Mass.232.345
SMILESCc1sc(C)c2C(CCCc12)c1cnc[nH]1