Reaction Details
TargetAlpha-2A adrenergic receptor [16-465]
LigandBDBM50085680
Substrate/Competitorn/a
Meas. Tech.ChEMBL_33684 (CHEMBL647841)
Ki 1.5±n/a nM
Citation Ross, TMJetter, MCMcDonnell, MEBoyd, REConnelly, CDMartinez, RPLewis, MACodd, EERaffa, RBReitz, AB Alpha(2) adrenoceptor agonists as potential analgesic agents. 2. Discovery of 4-(4-imidazo)-1,3-dimethyl-6,7-dihydro-thianaphthene as a high-affinity ligand for the alpha(2D) adrenergic receptor. J Med Chem43:1423-6 (2001) Alpha-2A adrenergic receptor [16-465]
Name:Alpha-2A adrenergic receptor [16-465]
Type:G-protein coupled receptor
Mol. Mass.:48961.69
Organism:Rattus norvegicus (rat)
Description:P22909[16-465]
Residue:450
BDBM50085680
NameBDBM50085680
Synonyms:4-(6,7-Dihydro-benzo[b]thiophen-4-yl)-1H-imidazole | CHEMBL286246
TypeSmall organic molecule
Emp. Form.C11H10N2S
Mol. Mass.202.276
SMILESC1Cc2sccc2C(=C1)c1cnc[nH]1