Reaction Details
TargetBeta-1 adrenergic receptor
LigandBDBM50019061
Substrate/Competitorn/a
Meas. Tech.ChEMBL_37540 (CHEMBL647622)
Ki 63000±n/a nM
Citation Lu, SFHerbert, BHaufe, GLaue, KWPadgett, WLOshunleti, ODaly, JWKirk, KL Syntheses of (R)- and (S)-2- and 6-fluoronorepinephrine and (R)- and (S)-2- and 6-fluoroepinephrine: effect of stereochemistry on fluorine-induced adrenergic selectivities. J Med Chem43:1611-9 (2000) Beta-1 adrenergic receptor
Name:Beta-1 adrenergic receptor
Type:Protein
Mol. Mass.:50486.84
Organism:Rattus norvegicus (Rat)
Description:P18090
Residue:466
BDBM50019061
NameBDBM50019061
Synonyms:(+/-)4-(2-Amino-1-hydroxy-ethyl)-5-fluoro-benzene-1,2-diol 4-(2-Amino-1-hydroxy-ethyl)-5-fluoro-benzene-1,2-diol(6-FNE) | CHEMBL281232
TypeSmall organic molecule
Emp. Form.C8H10FNO3
Mol. Mass.187.1683
SMILESNCC(O)c1cc(O)c(O)cc1F