Reaction Details
TargetG protein-activated inward rectifier potassium channel 4
LigandBDBM50532028
Substrate/Competitorn/a
Meas. Tech.ChEMBL_1921816 (CHEMBL4424661)
EC50 659±n/a nM
Citation Sharma, SKozek, KAAbney, KKKumar, SGautam, NAlnouti, YDavid Weaver, CHopkins, CR Discovery, synthesis and characterization of a series of (1-alkyl-3-methyl-1H-pyrazol-5-yl)-2-(5-aryl-2H-tetrazol-2-yl)acetamides as novel GIRK1/2 potassium channel activators. Bioorg Med Chem Lett29:791-796 (2019) 
 
G protein-activated inward rectifier potassium channel 4
Name:G protein-activated inward rectifier potassium channel 4
Type:PROTEIN
Mol. Mass.:47658.06
Organism:Homo sapiens (Human)
Description:ChEMBL_107914
Residue:419
BDBM50532028
NameBDBM50532028
Synonyms:CHEMBL4586820
TypeSmall organic molecule
Emp. Form.C21H25N7O
Mol. Mass.391.4695
SMILESO=C(Cn1nnc(n1)-c1ccccc1)Nc1cc(nn1C1CCCCC1)C1CC1