Reaction Details
TargetVasopressin V2 receptor
LigandBDBM50087669
Substrate/Competitorn/a
Meas. Tech.ChEBML_214705
IC50 12±n/a nM
Citation Ashwell, MABagli, JFCaggiano, TJChan, PSMolinari, AJPalka, CPark, CHRogers, JFSherman, MTrybulski, EJWilliams, DK The design, synthesis and physical chemical properties of novel human vasopressin V2-receptor antagonists optimized for parenteral delivery. Bioorg Med Chem Lett10:783-6 (2000) Vasopressin V2 receptor
Name:Vasopressin V2 receptor
Type:Receptor
Mol. Mass.:40295.28
Organism:Homo sapiens (Human)
Description:P30518
Residue:371
BDBM50087669
NameBDBM50087669
Synonyms:Biphenyl-2-carboxylic acid {3-chloro-4-[3-(4-methyl-piperazine-1-carbonyl)-5H,11H-benzo[e]pyrrolo[1,2-a][1,4]diazepine-10-carbonyl]-phenyl}-amide; compound with 3-carboxy-3-hydroxy-pentanedioic acid | CHEMBL164387
TypeSmall organic molecule
Emp. Form.C38H34ClN5O3
Mol. Mass.644.161
SMILESCN1CCN(CC1)C(=O)c1ccc2CN(C(=O)c3ccc(NC(=O)c4ccccc4-c4ccccc4)cc3Cl)c3ccccc3Cn12