Reaction Details
TargetLeukotriene B4 receptor 1
LigandBDBM50087680
Substrate/Competitorn/a
Meas. Tech.ChEMBL_99644 (CHEMBL873871)
IC50 2000±n/a nM
Citation Durand, DHullot, PVidal, JPGirard, JPBanères, JLParello, JMuller, ABonne, CRossi, JC Leukotriene B4 photoaffinity probes: design, synthesis and evaluation of new arylazide-1,3-disubstituted cyclohexanes. Bioorg Med Chem Lett10:811-4 (2000) Leukotriene B4 receptor 1
Name:Leukotriene B4 receptor 1
Type:Enzyme Catalytic Domain
Mol. Mass.:37582.68
Organism:Homo sapiens (Human)
Description:Q15722
Residue:352
BDBM50087680
NameBDBM50087680
Synonyms:2-{3-[(E)-7-(4-Azido-phenyl)-3-hydroxy-hept-1-enyl]-1-hydroxy-cyclohexyl}-N,N-dimethyl-acetamide | CHEMBL167465
TypeSmall organic molecule
Emp. Form.C23H34N4O3
Mol. Mass.414.5411
SMILESCN(C)C(=O)CC1(O)CCCC(C1)\C=C\C(O)CCCCc1ccc(cc1)N=[N+]=[N-]