Reaction Details
TargetLeukotriene B4 receptor 1
LigandBDBM50087677
Substrate/Competitorn/a
Meas. Tech.ChEMBL_99644 (CHEMBL873871)
IC50 6000±n/a nM
Citation Durand, DHullot, PVidal, JPGirard, JPBanères, JLParello, JMuller, ABonne, CRossi, JC Leukotriene B4 photoaffinity probes: design, synthesis and evaluation of new arylazide-1,3-disubstituted cyclohexanes. Bioorg Med Chem Lett10:811-4 (2000) Leukotriene B4 receptor 1
Name:Leukotriene B4 receptor 1
Type:Enzyme Catalytic Domain
Mol. Mass.:37582.68
Organism:Homo sapiens (Human)
Description:Q15722
Residue:352
BDBM50087677
NameBDBM50087677
Synonyms:2-{3-[(E)-7-(4-Azido-3-iodo-phenyl)-3-hydroxy-hept-1-enyl]-1-hydroxy-cyclohexyl}-N,N-dimethyl-acetamide | CHEMBL352717
TypeSmall organic molecule
Emp. Form.C23H33IN4O3
Mol. Mass.540.4376
SMILESCN(C)C(=O)CC1(O)CCCC(C1)\C=C\C(O)CCCCc1ccc(N=[N+]=[N-])c(I)c1