Reaction Details
TargetStromelysin-1
LigandBDBM50033808
Substrate/Competitorn/a
Meas. Tech.ChEMBL_1922605 (CHEMBL4425561)
IC50 69000±n/a nM
Citation Wiley, MRDurham, TBAdams, LAChambers, MGLin, CLiu, CMarimuthu, JMitchell, PGMudra, DRSwearingen, CAToth, JLWeller, JMThirunavukkarasu, K Use of Osmotic Pumps to Establish the Pharmacokinetic-Pharmacodynamic Relationship and Define Desirable Human Performance Characteristics for Aggrecanase Inhibitors. J Med Chem59:5810-22 (2016) 
 
Stromelysin-1
Name:Stromelysin-1
Type:Enzyme
Mol. Mass.:53973.13
Organism:Homo sapiens (Human)
Description: P08254
Residue:477
BDBM50033808
NameBDBM50033808
Synonyms:CHEMBL3358158
TypeSmall organic molecule
Emp. Form.C18H14F3N5O4
Mol. Mass.421.3301
SMILESCn1ccnc1[C@]1(CNC(=O)c2cc3cc(ccc3o2)C(F)(F)F)NC(=O)NC1=O