Reaction Details
TargetA disintegrin and metalloproteinase with thrombospondin motifs 5
LigandBDBM50033808
Substrate/Competitorn/a
Meas. Tech.ChEMBL_1922602 (CHEMBL4425558)
IC50 35±n/a nM
Citation Wiley, MRDurham, TBAdams, LAChambers, MGLin, CLiu, CMarimuthu, JMitchell, PGMudra, DRSwearingen, CAToth, JLWeller, JMThirunavukkarasu, K Use of Osmotic Pumps to Establish the Pharmacokinetic-Pharmacodynamic Relationship and Define Desirable Human Performance Characteristics for Aggrecanase Inhibitors. J Med Chem59:5810-22 (2016) 
 
A disintegrin and metalloproteinase with thrombospondin motifs 5
Name:A disintegrin and metalloproteinase with thrombospondin motifs 5
Type:Enzyme
Mol. Mass.:101769.09
Organism:Homo sapiens (Human)
Description:Q9UNA0
Residue:930
BDBM50033808
NameBDBM50033808
Synonyms:CHEMBL3358158
TypeSmall organic molecule
Emp. Form.C18H14F3N5O4
Mol. Mass.421.3301
SMILESCn1ccnc1[C@]1(CNC(=O)c2cc3cc(ccc3o2)C(F)(F)F)NC(=O)NC1=O