Reaction Details
TargetGlutamate receptor ionotropic, kainate 2
LigandBDBM50088205
Substrate/Competitorn/a
Meas. Tech.ChEMBL_90582 (CHEMBL701166)
Ki 559±n/a nM
Citation Pedregal, CCollado, IEscribano, AEzquerra, JDomínguez, CMateo, AIRubio, ABaker, SRGoldsworthy, JKamboj, RKBallyk, BAHoo, KBleakman, D 4-Alkyl- and 4-cinnamylglutamic acid analogues are potent GluR5 kainate receptor agonists. J Med Chem43:1958-68 (2000) Glutamate receptor ionotropic, kainate 2
Name:Glutamate receptor ionotropic, kainate 2
Type:Enzyme Catalytic Domain
Mol. Mass.:102592.78
Organism:Homo sapiens (Human)
Description:Q13002
Residue:908
BDBM50088205
NameBDBM50088205
Synonyms:CHEMBL294683 | E-2-Amino-4-[3-(4-fluoro-phenyl)-allyl]-pentanedioic acid
TypeSmall organic molecule
Emp. Form.C14H16FNO4
Mol. Mass.281.2795
SMILESN[C@@H](C[C@@H](C\C=C\c1ccc(F)cc1)C(O)=O)C(O)=O