Reaction Details
TargetGlutamate receptor ionotropic, kainate 2
LigandBDBM50088216
Substrate/Competitorn/a
Meas. Tech.ChEMBL_90457 (CHEMBL699992)
Ki 48±n/a nM
Citation Pedregal, CCollado, IEscribano, AEzquerra, JDomínguez, CMateo, AIRubio, ABaker, SRGoldsworthy, JKamboj, RKBallyk, BAHoo, KBleakman, D 4-Alkyl- and 4-cinnamylglutamic acid analogues are potent GluR5 kainate receptor agonists. J Med Chem43:1958-68 (2000) Glutamate receptor ionotropic, kainate 2
Name:Glutamate receptor ionotropic, kainate 2
Type:Enzyme Catalytic Domain
Mol. Mass.:102592.78
Organism:Homo sapiens (Human)
Description:Q13002
Residue:908
BDBM50088216
NameBDBM50088216
Synonyms:CHEMBL59284 LY-339296
TypeSmall organic molecule
Emp. Form.C15H19NO5
Mol. Mass.293.3151
SMILESCOc1ccccc1\C=C\C[C@H](C[C@H](N)C(O)=O)C(O)=O