Reaction Details
TargetGlutamate receptor ionotropic, kainate 2
LigandBDBM50031704
Substrate/Competitorn/a
Meas. Tech.ChEMBL_90582 (CHEMBL701166)
Ki 10±n/a nM
Citation Pedregal, CCollado, IEscribano, AEzquerra, JDomínguez, CMateo, AIRubio, ABaker, SRGoldsworthy, JKamboj, RKBallyk, BAHoo, KBleakman, D 4-Alkyl- and 4-cinnamylglutamic acid analogues are potent GluR5 kainate receptor agonists. J Med Chem43:1958-68 (2000) Glutamate receptor ionotropic, kainate 2
Name:Glutamate receptor ionotropic, kainate 2
Type:Enzyme Catalytic Domain
Mol. Mass.:102592.78
Organism:Homo sapiens (Human)
Description:Q13002
Residue:908
BDBM50031704
NameBDBM50031704
Synonyms:(2S,4R)-2-Amino-4-methyl-pentanedioic acid (2S,4R)-4-methylglutamic acid CHEMBL288166
TypeSmall organic molecule
Emp. Form.C6H11NO4
Mol. Mass.161.1558
SMILESC[C@H](C[C@H](N)C(O)=O)C(O)=O