Reaction Details
TargetSigma non-opioid intracellular receptor 1
LigandBDBM50532513
Substrate/Competitorn/a
Meas. Tech.ChEMBL_1923200 (CHEMBL4426156)
Ki 3.4±n/a nM
Citation Sun, HShi, MZhang, WZheng, YMXu, YZShi, JJLiu, TGunosewoyo, HPang, TGao, ZBYang, FTang, JYu, LF Development of Novel Alkoxyisoxazoles as Sigma-1 Receptor Antagonists with Antinociceptive Efficacy. J Med Chem59:6329-43 (2016) 
 
Sigma non-opioid intracellular receptor 1
Name:Sigma non-opioid intracellular receptor 1
Type:Enzyme Catalytic Domain
Mol. Mass.:25266.54
Organism:RAT
Description:Q9R0C9
Residue:223
BDBM50532513
NameBDBM50532513
Synonyms:CHEMBL4579980
TypeSmall organic molecule
Emp. Form.C16H21ClN2O3
Mol. Mass.324.803
SMILESCl.CN1CCC[C@H]1COc1cc(COc2ccccc2)on1