Reaction Details
TargetSigma non-opioid intracellular receptor 1
LigandBDBM50532515
Substrate/Competitorn/a
Meas. Tech.ChEMBL_1923200 (CHEMBL4426156)
Ki 3.2±n/a nM
Citation Sun, HShi, MZhang, WZheng, YMXu, YZShi, JJLiu, TGunosewoyo, HPang, TGao, ZBYang, FTang, JYu, LF Development of Novel Alkoxyisoxazoles as Sigma-1 Receptor Antagonists with Antinociceptive Efficacy. J Med Chem59:6329-43 (2016) 
 
Sigma non-opioid intracellular receptor 1
Name:Sigma non-opioid intracellular receptor 1
Type:Enzyme Catalytic Domain
Mol. Mass.:25266.54
Organism:RAT
Description:Q9R0C9
Residue:223
BDBM50532515
NameBDBM50532515
Synonyms:CHEMBL4470605
TypeSmall organic molecule
Emp. Form.C15H18BrClN2O3
Mol. Mass.389.672
SMILESCl.Brc1cccc(OCc2cc(OC[C@@H]3CCCN3)no2)c1