Reaction Details
TargetSigma non-opioid intracellular receptor 1
LigandBDBM50532516
Substrate/Competitorn/a
Meas. Tech.ChEMBL_1923200 (CHEMBL4426156)
Ki 2.6±n/a nM
Citation Sun, HShi, MZhang, WZheng, YMXu, YZShi, JJLiu, TGunosewoyo, HPang, TGao, ZBYang, FTang, JYu, LF Development of Novel Alkoxyisoxazoles as Sigma-1 Receptor Antagonists with Antinociceptive Efficacy. J Med Chem59:6329-43 (2016) 
 
Sigma non-opioid intracellular receptor 1
Name:Sigma non-opioid intracellular receptor 1
Type:Enzyme Catalytic Domain
Mol. Mass.:25266.54
Organism:RAT
Description:Q9R0C9
Residue:223
BDBM50532516
NameBDBM50532516
Synonyms:CHEMBL4460187
TypeSmall organic molecule
Emp. Form.C17H18ClF3N2O5
Mol. Mass.422.783
SMILESOC(=O)C(F)(F)F.Clc1cccc(OCc2cc(OC[C@@H]3CCCN3)no2)c1