Reaction Details
TargetSigma non-opioid intracellular receptor 1
LigandBDBM50532518
Substrate/Competitorn/a
Meas. Tech.ChEMBL_1923200 (CHEMBL4426156)
Ki 0.500000±n/a nM
Citation Sun, HShi, MZhang, WZheng, YMXu, YZShi, JJLiu, TGunosewoyo, HPang, TGao, ZBYang, FTang, JYu, LF Development of Novel Alkoxyisoxazoles as Sigma-1 Receptor Antagonists with Antinociceptive Efficacy. J Med Chem59:6329-43 (2016) 
 
Sigma non-opioid intracellular receptor 1
Name:Sigma non-opioid intracellular receptor 1
Type:Enzyme Catalytic Domain
Mol. Mass.:25266.54
Organism:RAT
Description:Q9R0C9
Residue:223
BDBM50532518
NameBDBM50532518
Synonyms:CHEMBL4440420
TypeSmall organic molecule
Emp. Form.C19H26Cl2N2O3
Mol. Mass.401.327
SMILESCl.CN(CCOc1cc(COc2cccc(Cl)c2)on1)C1CCCCC1