Reaction Details
TargetSigma non-opioid intracellular receptor 1
LigandBDBM50532505
Substrate/Competitorn/a
Meas. Tech.ChEMBL_1923200 (CHEMBL4426156)
Ki 1.8±n/a nM
Citation Sun, HShi, MZhang, WZheng, YMXu, YZShi, JJLiu, TGunosewoyo, HPang, TGao, ZBYang, FTang, JYu, LF Development of Novel Alkoxyisoxazoles as Sigma-1 Receptor Antagonists with Antinociceptive Efficacy. J Med Chem59:6329-43 (2016) 
 
Sigma non-opioid intracellular receptor 1
Name:Sigma non-opioid intracellular receptor 1
Type:Enzyme Catalytic Domain
Mol. Mass.:25266.54
Organism:RAT
Description:Q9R0C9
Residue:223
BDBM50532505
NameBDBM50532505
Synonyms:CHEMBL4535404
TypeSmall organic molecule
Emp. Form.C17H23ClN2O3
Mol. Mass.338.829
SMILESCl.CN(CCOc1cc(COc2ccccc2)on1)C1CCC1