Reaction Details
TargetSigma non-opioid intracellular receptor 1
LigandBDBM50532493
Substrate/Competitorn/a
Meas. Tech.ChEMBL_1923200 (CHEMBL4426156)
Ki 2.7±n/a nM
Citation Sun, HShi, MZhang, WZheng, YMXu, YZShi, JJLiu, TGunosewoyo, HPang, TGao, ZBYang, FTang, JYu, LF Development of Novel Alkoxyisoxazoles as Sigma-1 Receptor Antagonists with Antinociceptive Efficacy. J Med Chem59:6329-43 (2016) 
 
Sigma non-opioid intracellular receptor 1
Name:Sigma non-opioid intracellular receptor 1
Type:Enzyme Catalytic Domain
Mol. Mass.:25266.54
Organism:RAT
Description:Q9R0C9
Residue:223
BDBM50532493
NameBDBM50532493
Synonyms:CHEMBL4533250
TypeSmall organic molecule
Emp. Form.C15H18Cl2N2O3
Mol. Mass.345.221
SMILESCl.Clc1ccccc1OCc1cc(OC[C@@H]2CCCN2)no1