Reaction Details
TargetSigma non-opioid intracellular receptor 1
LigandBDBM50532512
Substrate/Competitorn/a
Meas. Tech.ChEMBL_1923200 (CHEMBL4426156)
Ki 0.800000±n/a nM
Citation Sun, HShi, MZhang, WZheng, YMXu, YZShi, JJLiu, TGunosewoyo, HPang, TGao, ZBYang, FTang, JYu, LF Development of Novel Alkoxyisoxazoles as Sigma-1 Receptor Antagonists with Antinociceptive Efficacy. J Med Chem59:6329-43 (2016) 
 
Sigma non-opioid intracellular receptor 1
Name:Sigma non-opioid intracellular receptor 1
Type:Enzyme Catalytic Domain
Mol. Mass.:25266.54
Organism:RAT
Description:Q9R0C9
Residue:223
BDBM50532512
NameBDBM50532512
Synonyms:CHEMBL4539105
TypeSmall organic molecule
Emp. Form.C17H23ClN2O3
Mol. Mass.338.829
SMILESCl.CN(CCOc1cc(COc2ccccc2)on1)CC1CC1