Reaction Details
TargetSigma non-opioid intracellular receptor 1
LigandBDBM50532521
Substrate/Competitorn/a
Meas. Tech.ChEMBL_1923200 (CHEMBL4426156)
Ki 1.4±n/a nM
Citation Sun, HShi, MZhang, WZheng, YMXu, YZShi, JJLiu, TGunosewoyo, HPang, TGao, ZBYang, FTang, JYu, LF Development of Novel Alkoxyisoxazoles as Sigma-1 Receptor Antagonists with Antinociceptive Efficacy. J Med Chem59:6329-43 (2016) 
 
Sigma non-opioid intracellular receptor 1
Name:Sigma non-opioid intracellular receptor 1
Type:Enzyme Catalytic Domain
Mol. Mass.:25266.54
Organism:RAT
Description:Q9R0C9
Residue:223
BDBM50532521
NameBDBM50532521
Synonyms:CHEMBL4524740
TypeSmall organic molecule
Emp. Form.C15H18ClFN2O3
Mol. Mass.328.766
SMILESCl.Fc1cccc(OCc2cc(OC[C@@H]3CCCN3)no2)c1