Reaction Details
TargetAdenosine receptor A1
LigandBDBM50067079
Substrate/Competitorn/a
Meas. Tech.ChEMBL_29302 (CHEMBL640363)
Ki 240±n/a nM
Citation van Muijlwijk-Koezen, JETimmerman, Hvan der Goot, HMenge, WMFrijtag Von Drabbe Künzel, Jde Groote, MIJzerman, AP Isoquinoline and quinazoline urea analogues as antagonists for the human adenosine A(3) receptor. J Med Chem43:2227-38 (2000) Adenosine receptor A1
Name:Adenosine receptor A1
Type:Protein
Mol. Mass.:36704.13
Organism:Rattus norvegicus (rat)
Description:n/a
Residue:326
BDBM50067079
NameBDBM50067079
Synonyms:1-Phenyl-2-(3-pyridin-2-yl-isoquinolin-1-yl)-ethanone | CHEMBL72287
TypeSmall organic molecule
Emp. Form.C22H16N2O
Mol. Mass.324.3752
SMILESO=C(Cc1nc(cc2ccccc12)-c1ccccn1)c1ccccc1