Reaction Details
TargetAdenosine receptor A1
LigandBDBM50088478
Substrate/Competitorn/a
Meas. Tech.ChEMBL_29302 (CHEMBL640363)
Ki 295000.0±n/a nM
Citation van Muijlwijk-Koezen, JETimmerman, Hvan der Goot, HMenge, WMFrijtag Von Drabbe Künzel, Jde Groote, MIJzerman, AP Isoquinoline and quinazoline urea analogues as antagonists for the human adenosine A(3) receptor. J Med Chem43:2227-38 (2000) Adenosine receptor A1
Name:Adenosine receptor A1
Type:Protein
Mol. Mass.:36704.13
Organism:Rattus norvegicus (rat)
Description:n/a
Residue:326
BDBM50088478
NameBDBM50088478
Synonyms:1-(2-Pyridin-3-yl-quinazolin-4-yl)-3-o-tolyl-urea | CHEMBL72172
TypeSmall organic molecule
Emp. Form.C21H17N5O
Mol. Mass.355.3926
SMILESCc1ccccc1NC(=O)Nc1nc(nc2ccccc12)-c1cccnc1