Reaction Details
TargetAdenosine receptor A3
LigandBDBM50088478
Substrate/Competitorn/a
Meas. Tech.ChEMBL_31844 (CHEMBL641521)
Ki 23900±n/a nM
Citation van Muijlwijk-Koezen, JETimmerman, Hvan der Goot, HMenge, WMFrijtag Von Drabbe Künzel, Jde Groote, MIJzerman, AP Isoquinoline and quinazoline urea analogues as antagonists for the human adenosine A(3) receptor. J Med Chem43:2227-38 (2000) Adenosine receptor A3
Name:Adenosine receptor A3
Type:G Protein-Coupled Receptor (GPCR)
Mol. Mass.:36197.32
Organism:Homo sapiens (Human)
Description:P0DMS8
Residue:318
BDBM50088478
NameBDBM50088478
Synonyms:1-(2-Pyridin-3-yl-quinazolin-4-yl)-3-o-tolyl-urea | CHEMBL72172
TypeSmall organic molecule
Emp. Form.C21H17N5O
Mol. Mass.355.3926
SMILESCc1ccccc1NC(=O)Nc1nc(nc2ccccc12)-c1cccnc1