Reaction Details
TargetSerotonin 2 (5-HT2) receptor
LigandBDBM50088847
Substrate/Competitorn/a
Meas. Tech.ChEMBL_2250 (CHEMBL617195)
Ki>1000±n/a nM
Citation Hanano, TAdachi, KAoki, YMorimoto, HNaka, YHisadome, MFukuda, TSumichika, H Novel phenylpiperazine derivatives as dual cytokine regulators with TNF-alpha suppressing and IL-10 augmenting activity. Bioorg Med Chem Lett10:875-9 (2000) Serotonin 2 (5-HT2) receptor
Name:Serotonin 2 (5-HT2) receptor
Synonyms:5-hydroxytryptamine receptor 2A/2B/2C
Type:n/a
Mol. Mass.:n/a
Description:ASSAY_ID of ChEMBL is 2197423
Components:This complex has 3 components.
Component 1
Name:5-hydroxytryptamine receptor 2B
Type:G Protein-Coupled Receptor (GPCR)
Mol. Mass.:54312.47
Organism:Homo sapiens (Human)
Description:Receptor binding assays were performed using human clone stably expressed in CHO cells.
Residue:481
Component 2
Name:5-hydroxytryptamine receptor 2A
Synonyms:5-HT-2 5-HT2A 5-hydroxytryptamine receptor 2A (5HT-2A) 5HT2A_HUMAN HTR2A | Serotonin receptor 2A
Type:undefined
Mol. Mass.:52607.65
Organism:Homo sapiens (Human)
Description:P28223
Residue:471
Component 3
Name:5-hydroxytryptamine receptor 2C
Synonyms:5-HT-1C 5-HT1C 5-HT2C-INI 5-HTR2C 5-hydroxytryptamine receptor 2C (5-HT-2C) 5HT-1C HTR1C Serotonin (5-HT3) receptor Serotonin Receptor 2C
Type:G Protein-Coupled Receptor (GPCR)
Mol. Mass.:51836.79
Organism:Homo sapiens (Human)
Description:P28335
Residue:458
BDBM50088847
NameBDBM50088847
Synonyms:CHEMBL171345 | N-{4-[4-(4-Chloro-phenyl)-piperazin-1-ylmethyl]-benzyl}-acetamide
TypeSmall organic molecule
Emp. Form.C20H24ClN3O
Mol. Mass.357.877
SMILESCC(=O)NCc1ccc(CN2CCN(CC2)c2ccc(Cl)cc2)cc1