Reaction Details
TargetD(2) dopamine receptor
LigandBDBM50088846
Substrate/Competitorn/a
Meas. Tech.ChEBML_59636
Ki 170±n/a nM
Citation Hanano, TAdachi, KAoki, YMorimoto, HNaka, YHisadome, MFukuda, TSumichika, H Novel phenylpiperazine derivatives as dual cytokine regulators with TNF-alpha suppressing and IL-10 augmenting activity. Bioorg Med Chem Lett10:875-9 (2000) D(2) dopamine receptor
Name:D(2) dopamine receptor
Type:Enzyme Catalytic Domain
Mol. Mass.:50698.79
Organism:BOVINE
Description:P20288
Residue:444
BDBM50088846
NameBDBM50088846
Synonyms:CHEMBL353678 | N-{4-[2-(4-Phenyl-piperazin-1-yl)-ethyl]-benzyl}-acetamide
TypeSmall organic molecule
Emp. Form.C21H27N3O
Mol. Mass.337.4586
SMILESCC(=O)NCc1ccc(CCN2CCN(CC2)c2ccccc2)cc1