Reaction Details
TargetProto-oncogene tyrosine-protein kinase Src
LigandBDBM50088903
Substrate/Competitorn/a
Meas. Tech.ChEMBL_216859 (CHEMBL816696)
IC50 30±n/a nM
Citation Missbach, MAltmann, EWidler, LSusa, MBuchdunger, EMett, HMeyer, TGreen, J Substituted 5,7-diphenyl-pyrrolo[2,3d]pyrimidines: potent inhibitors of the tyrosine kinase c-Src. Bioorg Med Chem Lett10:945-9 (2000) Proto-oncogene tyrosine-protein kinase Src
Name:Proto-oncogene tyrosine-protein kinase Src
Type:Tyr protein kinase
Mol. Mass.:60015.36
Organism:Gallus gallus (Chicken)
Description:P00523
Residue:533
BDBM50088903
NameBDBM50088903
Synonyms:2-((4-(4-amino-5-(3-methoxyphenyl)-7H-pyrrolo[2,3-d]pyrimidin-7-yl)phenethyl)(methyl)amino)ethanol CHEMBL105436
TypeSmall organic molecule
Emp. Form.C24H27N5O2
Mol. Mass.417.5035
SMILESCOc1cccc(c1)-c1cn(-c2ccc(CCN(C)CCO)cc2)c2ncnc(N)c12