Reaction Details
TargetTyrosine-protein kinase ABL1/ABL2
LigandBDBM50088904
Substrate/Competitorn/a
Meas. Tech.ChEBML_226000
IC50 50±n/a nM
Citation Missbach, MAltmann, EWidler, LSusa, MBuchdunger, EMett, HMeyer, TGreen, J Substituted 5,7-diphenyl-pyrrolo[2,3d]pyrimidines: potent inhibitors of the tyrosine kinase c-Src. Bioorg Med Chem Lett10:945-9 (2000) Tyrosine-protein kinase ABL1/ABL2
Name:Tyrosine-protein kinase ABL1/ABL2
Synonyms:Tyrosine-protein kinase ABL
Type:n/a
Mol. Mass.:n/a
Description:ASSAY_ID of EBI is 226000
Components:This complex has 2 components.
Component 1
Name:Tyrosine-protein kinase ABL1
Type:Enzyme
Mol. Mass.:122897.30
Organism:Homo sapiens (Human)
Description:P00519
Residue:1130
Component 2
Name:Tyrosine-protein kinase ABL2
Synonyms:ABL2 ABLL Abelson murine leukemia viral oncogene homolog 2 Tyrosine kinase ARG | VHL/Tyrosine-protein kinase ABL2
Type:PROTEIN
Mol. Mass.:128360.63
Organism:Homo sapiens (Human)
Description:ChEMBL_325082
Residue:1182
BDBM50088904
NameBDBM50088904
Synonyms:(3-(4-amino-5-(3-methoxyphenyl)-7H-pyrrolo[2,3-d]pyrimidin-7-yl)phenyl)methanol {3-[4-Amino-5-(3-methoxy-phenyl)-pyrrolo[2,3-d]pyrimidin-7-yl]-phenyl}-methanol
TypeSmall organic molecule
Emp. Form.C20H18N4O2
Mol. Mass.346.3825
SMILESCOc1cccc(c1)-c1cn(-c2cccc(CO)c2)c2ncnc(N)c12