Reaction Details
TargetTyrosine-protein kinase CSK
LigandBDBM50088898
Substrate/Competitorn/a
Meas. Tech.ChEBML_225999
IC50>5000±n/a nM
Citation Missbach, MAltmann, EWidler, LSusa, MBuchdunger, EMett, HMeyer, TGreen, J Substituted 5,7-diphenyl-pyrrolo[2,3d]pyrimidines: potent inhibitors of the tyrosine kinase c-Src. Bioorg Med Chem Lett10:945-9 (2000) Tyrosine-protein kinase CSK
Name:Tyrosine-protein kinase CSK
Type:Tyrosine-protein kinase
Mol. Mass.:50707.30
Organism:Homo sapiens (Human)
Description:P41240
Residue:450
BDBM50088898
NameBDBM50088898
Synonyms:2-(4-(4-amino-5-(3-methoxyphenyl)-7H-pyrrolo[2,3-d]pyrimidin-7-yl)phenyl)-N-(2-hydroxyethyl)acetamide CHEMBL175409
TypeSmall organic molecule
Emp. Form.C23H23N5O3
Mol. Mass.417.4604
SMILESCOc1cccc(c1)-c1cn(-c2ccc(CC(=O)NCCO)cc2)c2ncnc(N)c12