Reaction Details
TargetUrokinase-type plasminogen activator
LigandBDBM50088978
Substrate/Competitorn/a
Meas. Tech.ChEBML_212977
IC50 5.1±n/a nM
Citation Tamura, SYWeinhouse, MIRoberts, CAGoldman, EAMasukawa, KAnderson, SMCohen, CRBradbury, AEBernardino, VTDixon, SAMa, MGNolan, TGBrunck, TK Synthesis and biological activity of peptidyl aldehyde urokinase inhibitors. Bioorg Med Chem Lett10:983-7 (2000) Urokinase-type plasminogen activator
Name:Urokinase-type plasminogen activator
Type:Enzyme
Mol. Mass.:48528.62
Organism:Homo sapiens (Human)
Description:P00749
Residue:431
BDBM50088978
NameBDBM50088978
Synonyms:CHEMBL176515 | N-[1-(1-Carbamimidoyl-2-hydroxy-piperidin-3-ylcarbamoyl)-ethyl]-3-hydroxy-2-phenylmethanesulfonylamino-propionamide
TypeSmall organic molecule
Emp. Form.C19H30N6O6S
Mol. Mass.470.543
SMILESC[C@H](NC(=O)[C@@H](CO)NS(=O)(=O)Cc1ccccc1)C(=O)N[C@H]1CCCN(C1O)C(N)=N