Reaction Details
TargetPlasminogen
LigandBDBM50088977
Substrate/Competitorn/a
Meas. Tech.ChEBML_155082
IC50 904.0±n/a nM
Citation Tamura, SYWeinhouse, MIRoberts, CAGoldman, EAMasukawa, KAnderson, SMCohen, CRBradbury, AEBernardino, VTDixon, SAMa, MGNolan, TGBrunck, TK Synthesis and biological activity of peptidyl aldehyde urokinase inhibitors. Bioorg Med Chem Lett10:983-7 (2000) Plasminogen
Name:Plasminogen
Type:Enzyme
Mol. Mass.:90579.18
Organism:Homo sapiens (Human)
Description:n/a
Residue:810
BDBM50088977
NameBDBM50088977
Synonyms:CHEMBL177557 | {1-[1-(1-Carbamimidoyl-2-hydroxy-piperidin-3-ylcarbamoyl)-ethylcarbamoyl]-2-hydroxy-ethyl}-carbamic acid benzyl ester
TypeSmall organic molecule
Emp. Form.C20H30N6O6
Mol. Mass.450.4888
SMILESC[C@H](NC(=O)[C@@H](CO)NC(=O)OCc1ccccc1)C(=O)N[C@H]1CCCN(C1O)C(N)=N