Reaction Details
TargetPlasminogen
LigandBDBM50088980
Substrate/Competitorn/a
Meas. Tech.ChEBML_155082
IC50>2500±n/a nM
Citation Tamura, SYWeinhouse, MIRoberts, CAGoldman, EAMasukawa, KAnderson, SMCohen, CRBradbury, AEBernardino, VTDixon, SAMa, MGNolan, TGBrunck, TK Synthesis and biological activity of peptidyl aldehyde urokinase inhibitors. Bioorg Med Chem Lett10:983-7 (2000) Plasminogen
Name:Plasminogen
Type:Enzyme
Mol. Mass.:90579.18
Organism:Homo sapiens (Human)
Description:n/a
Residue:810
BDBM50088980
NameBDBM50088980
Synonyms:CHEMBL177745 | {(R)-1-[(S)-1-((S)-1-Carbamimidoyl-2-hydroxy-piperidin-3-ylcarbamoyl)-ethylcarbamoyl]-2-hydroxy-1-methyl-ethyl}-carbamic acid benzyl ester
TypeSmall organic molecule
Emp. Form.C21H32N6O6
Mol. Mass.464.5154
SMILESC[C@H](NC(=O)[C@@](C)(CO)NC(=O)OCc1ccccc1)C(=O)N[C@H]1CCCN(C1O)C(N)=N