Reaction Details
TargetTissue-type plasminogen activator
LigandBDBM50088986
Substrate/Competitorn/a
Meas. Tech.ChEBML_207872
IC50>2500±n/a nM
Citation Tamura, SYWeinhouse, MIRoberts, CAGoldman, EAMasukawa, KAnderson, SMCohen, CRBradbury, AEBernardino, VTDixon, SAMa, MGNolan, TGBrunck, TK Synthesis and biological activity of peptidyl aldehyde urokinase inhibitors. Bioorg Med Chem Lett10:983-7 (2000) Tissue-type plasminogen activator
Name:Tissue-type plasminogen activator
Type:Enzyme
Mol. Mass.:62931.08
Organism:Homo sapiens (Human)
Description:n/a
Residue:562
BDBM50088986
NameBDBM50088986
Synonyms:CHEMBL433809 | {2-[2-(1-Carbamimidoyl-2-hydroxy-piperidin-3-ylcarbamoyl)-piperidin-1-yl]-1-hydroxymethyl-2-oxo-ethyl}-carbamic acid benzyl ester
TypeSmall organic molecule
Emp. Form.C23H34N6O6
Mol. Mass.490.5527
SMILESNC(=N)N1CCC[C@@H](NC(=O)[C@H]2CCCCN2C(=O)[C@@H](CO)NC(=O)OCc2ccccc2)C1O