Reaction Details
TargetPlasminogen
LigandBDBM50088987
Substrate/Competitorn/a
Meas. Tech.ChEBML_155082
IC50 1460±n/a nM
Citation Tamura, SYWeinhouse, MIRoberts, CAGoldman, EAMasukawa, KAnderson, SMCohen, CRBradbury, AEBernardino, VTDixon, SAMa, MGNolan, TGBrunck, TK Synthesis and biological activity of peptidyl aldehyde urokinase inhibitors. Bioorg Med Chem Lett10:983-7 (2000) Plasminogen
Name:Plasminogen
Type:Enzyme
Mol. Mass.:90579.18
Organism:Homo sapiens (Human)
Description:n/a
Residue:810
BDBM50088987
NameBDBM50088987
Synonyms:CHEMBL174813 | {1-[1-(1-Carbamimidoyl-2-hydroxy-piperidin-3-ylcarbamoyl)-ethylcarbamoyl]-2-hydroxy-ethyl}-carbamic acid isobutyl ester; TFA
TypeSmall organic molecule
Emp. Form.C17H32N6O6
Mol. Mass.416.4726
SMILESCC(C)COC(=O)N[C@H](CO)C(=O)N[C@@H](C)C(=O)N[C@H]1CCCN(C1O)C(N)=N