Reaction Details
TargetPlasminogen
LigandBDBM50088985
Substrate/Competitorn/a
Meas. Tech.ChEBML_155082
IC50 125±n/a nM
Citation Tamura, SYWeinhouse, MIRoberts, CAGoldman, EAMasukawa, KAnderson, SMCohen, CRBradbury, AEBernardino, VTDixon, SAMa, MGNolan, TGBrunck, TK Synthesis and biological activity of peptidyl aldehyde urokinase inhibitors. Bioorg Med Chem Lett10:983-7 (2000) Plasminogen
Name:Plasminogen
Type:Enzyme
Mol. Mass.:90579.18
Organism:Homo sapiens (Human)
Description:n/a
Residue:810
BDBM50088985
NameBDBM50088985
Synonyms:CHEMBL369042 | {2-[2-(1-Carbamimidoyl-2-hydroxy-piperidin-3-ylcarbamoyl)-pyrrolidin-1-yl]-1-hydroxymethyl-2-oxo-ethyl}-carbamic acid benzyl ester
TypeSmall organic molecule
Emp. Form.C22H32N6O6
Mol. Mass.476.5261
SMILESNC(=N)N1CCCC(NC(=O)[C@H]2CCCN2C(=O)C(CO)NC(=O)OCc2ccccc2)C1O