Reaction Details
TargetTissue-type plasminogen activator
LigandBDBM50088983
Substrate/Competitorn/a
Meas. Tech.ChEBML_207872
IC50>2500±n/a nM
Citation Tamura, SYWeinhouse, MIRoberts, CAGoldman, EAMasukawa, KAnderson, SMCohen, CRBradbury, AEBernardino, VTDixon, SAMa, MGNolan, TGBrunck, TK Synthesis and biological activity of peptidyl aldehyde urokinase inhibitors. Bioorg Med Chem Lett10:983-7 (2000) Tissue-type plasminogen activator
Name:Tissue-type plasminogen activator
Type:Enzyme
Mol. Mass.:62931.08
Organism:Homo sapiens (Human)
Description:n/a
Residue:562
BDBM50088983
NameBDBM50088983
Synonyms:CHEMBL177251 | {1-[1-(1-Carbamimidoyl-2-hydroxy-piperidin-3-ylcarbamoyl)-ethylcarbamoyl]-2-hydroxy-ethyl}-carbamic acid benzyl ester
TypeSmall organic molecule
Emp. Form.C20H30N6O6
Mol. Mass.450.4888
SMILESC[C@@H](NC(=O)[C@@H](CO)NC(=O)OCc1ccccc1)C(=O)N[C@H]1CCCN(C1O)C(N)=N