Reaction Details
TargetNeuropeptide Y receptor type 5
LigandBDBM50089038
Substrate/Competitorn/a
Meas. Tech.ChEMBL_143989 (CHEMBL750827)
IC50 2.9±n/a nM
Citation Rueeger, HRigollier, PYamaguchi, YSchmidlin, TSchilling, WCriscione, LWhitebread, SChiesi, MWalker, MWDhanoa, DIslam, IZhang, JGluchowski, C Design, synthesis and SAR of a series of 2-substituted 4-amino-quinazoline neuropeptide Y Y5 receptor antagonists. Bioorg Med Chem Lett10:1175-9 (2000) Neuropeptide Y receptor type 5
Name:Neuropeptide Y receptor type 5
Type:Enzyme
Mol. Mass.:50746.64
Organism:Homo sapiens (Human)
Description:Q15761
Residue:445
BDBM50089038
NameBDBM50089038
Synonyms:CGP 71683 CHEMBL17645 Naphthalene-1-sulfonic acid {4-[(4-amino-quinazolin-2-ylamino)-methyl]-cyclohexylmethyl}-amide
TypeSmall organic molecule
Emp. Form.C26H29N5O2S
Mol. Mass.475.606
SMILESNc1nc(NC[C@H]2CC[C@H](CNS(=O)(=O)c3cccc4ccccc34)CC2)nc2ccccc12