Reaction Details
TargetNeuropeptide Y receptor type 5
LigandBDBM50089055
Substrate/Competitorn/a
Meas. Tech.ChEBML_143988
IC50 0.600000±n/a nM
Citation Rueeger, HRigollier, PYamaguchi, YSchmidlin, TSchilling, WCriscione, LWhitebread, SChiesi, MWalker, MWDhanoa, DIslam, IZhang, JGluchowski, C Design, synthesis and SAR of a series of 2-substituted 4-amino-quinazoline neuropeptide Y Y5 receptor antagonists. Bioorg Med Chem Lett10:1175-9 (2000) Neuropeptide Y receptor type 5
Name:Neuropeptide Y receptor type 5
Type:Enzyme
Mol. Mass.:50746.64
Organism:Homo sapiens (Human)
Description:Q15761
Residue:445
BDBM50089055
NameBDBM50089055
Synonyms:CHEMBL273811 | N*2*-(4-Ethanesulfonylmethyl-phenyl)-N*4*-phenyl-quinazoline-2,4-diamine
TypeSmall organic molecule
Emp. Form.C23H22N4O2S
Mol. Mass.418.511
SMILESCCS(=O)(=O)Cc1ccc(Nc2nc(Nc3ccccc3)c3ccccc3n2)cc1