Reaction Details
TargetNeuropeptide Y receptor type 5
LigandBDBM50089060
Substrate/Competitorn/a
Meas. Tech.ChEBML_143988
IC50 2.7±n/a nM
Citation Rueeger, HRigollier, PYamaguchi, YSchmidlin, TSchilling, WCriscione, LWhitebread, SChiesi, MWalker, MWDhanoa, DIslam, IZhang, JGluchowski, C Design, synthesis and SAR of a series of 2-substituted 4-amino-quinazoline neuropeptide Y Y5 receptor antagonists. Bioorg Med Chem Lett10:1175-9 (2000) Neuropeptide Y receptor type 5
Name:Neuropeptide Y receptor type 5
Type:Enzyme
Mol. Mass.:50746.64
Organism:Homo sapiens (Human)
Description:Q15761
Residue:445
BDBM50089060
NameBDBM50089060
Synonyms:CHEMBL273597 | Naphthalene-1-sulfonic acid [4-(4-amino-quinazolin-2-ylamino)-cyclohexylmethyl]-amide
TypeSmall organic molecule
Emp. Form.C25H27N5O2S
Mol. Mass.461.579
SMILESNc1nc(N[C@H]2CC[C@H](CNS(=O)(=O)c3cccc4ccccc34)CC2)nc2ccccc12