Reaction Details
TargetChymotrypsinogen A
LigandBDBM50089095
Substrate/Competitorn/a
Meas. Tech.ChEBML_49942
Ki 160000±n/a nM
Citation Wright, PARostom, AARobinson, CVSchofield, CJ Mass spectrometry reveals elastase inhibitors from the reactive centre loop of alpha1-antitrypsin. Bioorg Med Chem Lett10:1219-21 (2000) Chymotrypsinogen A
Name:Chymotrypsinogen A
Type:Serine protease
Mol. Mass.:25670.88
Organism:Bos taurus (bovine)
Description:n/a
Residue:245
BDBM50089095
NameBDBM50089095
Synonyms:CHEMBL216418 | Met-Phe-Leu-Glu-Ala-Ile-Pro-Met-Ser-Ile
TypeSmall organic molecule
Emp. Form.C53H86N10O14S2
Mol. Mass.1151.439
SMILESCC[C@@H](C)[C@H](NC(=O)[C@H](CO)NC(=O)[C@H](CCSC)NC(=O)[C@@H]1CCCN1C(=O)[C@H](NC(=O)[C@@H](C)NC(=O)[C@@H](CCC(O)=O)NC(=O)[C@@H](CC(C)C)NC(=O)[C@@H](Cc1ccccc1)NC(=O)[C@H](N)CCSC)[C@H](C)CC)C(O)=O