Reaction Details
TargetChymotrypsin-like elastase family member 2A
LigandBDBM50089095
Substrate/Competitorn/a
Meas. Tech.ChEBML_152317
Ki 100000±n/a nM
Citation Wright, PARostom, AARobinson, CVSchofield, CJ Mass spectrometry reveals elastase inhibitors from the reactive centre loop of alpha1-antitrypsin. Bioorg Med Chem Lett10:1219-21 (2000) Chymotrypsin-like elastase family member 2A
Name:Chymotrypsin-like elastase family member 2A
Type:PROTEIN
Mol. Mass.:28705.23
Organism:Sus scrofa
Description:ChEMBL_156951
Residue:269
BDBM50089095
NameBDBM50089095
Synonyms:CHEMBL216418 | Met-Phe-Leu-Glu-Ala-Ile-Pro-Met-Ser-Ile
TypeSmall organic molecule
Emp. Form.C53H86N10O14S2
Mol. Mass.1151.439
SMILESCC[C@@H](C)[C@H](NC(=O)[C@H](CO)NC(=O)[C@H](CCSC)NC(=O)[C@@H]1CCCN1C(=O)[C@H](NC(=O)[C@@H](C)NC(=O)[C@@H](CCC(O)=O)NC(=O)[C@@H](CC(C)C)NC(=O)[C@@H](Cc1ccccc1)NC(=O)[C@H](N)CCSC)[C@H](C)CC)C(O)=O