Reaction Details
TargetNeutrophil elastase
LigandBDBM50089098
Substrate/Competitorn/a
Meas. Tech.ChEBML_63966
Ki 19000±n/a nM
Citation Wright, PARostom, AARobinson, CVSchofield, CJ Mass spectrometry reveals elastase inhibitors from the reactive centre loop of alpha1-antitrypsin. Bioorg Med Chem Lett10:1219-21 (2000) Neutrophil elastase
Name:Neutrophil elastase
Type:Enzyme
Mol. Mass.:28532.38
Organism:Homo sapiens (Human)
Description:P08246
Residue:267
BDBM50089098
NameBDBM50089098
Synonyms:CHEMBL266704 | Cys-Phe-Leu-Glu-Ala-Ile-Pro-Met-Asp-Ile-Pro-Pro-Glu
TypeSmall organic molecule
Emp. Form.C68H107N13O19S2
Mol. Mass.1474.783
SMILESCC[C@@H](C)[C@@H](NC(=O)[C@@H](C)NC(=O)[C@@H](CCC(O)=O)NC(=O)[C@@H](CC(C)C)NC(=O)[C@@H](Cc1ccccc1)NC(=O)[C@H](N)CCSC)C(=O)N1CCC[C@H]1C(=O)N[C@@H](CCSC)C(=O)N[C@@H](CO)C(=O)N[C@@H]([C@H](C)CC)C(=O)N1CCC[C@@H]1C(=O)N1CCC[C@H]1C(=O)N[C@H](CCC(O)=O)C(O)=O