Reaction Details
TargetChymotrypsinogen A
LigandBDBM50089096
Substrate/Competitorn/a
Meas. Tech.ChEBML_49942
Ki 2300000±n/a nM
Citation Wright, PARostom, AARobinson, CVSchofield, CJ Mass spectrometry reveals elastase inhibitors from the reactive centre loop of alpha1-antitrypsin. Bioorg Med Chem Lett10:1219-21 (2000) Chymotrypsinogen A
Name:Chymotrypsinogen A
Type:Serine protease
Mol. Mass.:25670.88
Organism:Bos taurus (bovine)
Description:n/a
Residue:245
BDBM50089096
NameBDBM50089096
Synonyms:CHEMBL278549 ent-Met-Phe-Leu-Glu-Ala-Ile-Pro-Met
TypeSmall organic molecule
Emp. Form.C44H70N8O11S2
Mol. Mass.951.204
SMILESCC[C@@H](C)[C@@H](NC(=O)[C@@H](C)NC(=O)[C@@H](CCC(O)=O)NC(=O)[C@@H](CC(C)C)NC(=O)[C@@H](Cc1ccccc1)NC(=O)[C@H](N)CCSC)C(=O)N1CCC[C@H]1C(=O)N[C@@H](CCSC)C(O)=O