Reaction Details
TargetChymotrypsin-like elastase family member 2A
LigandBDBM50089094
Substrate/Competitorn/a
Meas. Tech.ChEBML_152317
Ki 5800000±n/a nM
Citation Wright, PARostom, AARobinson, CVSchofield, CJ Mass spectrometry reveals elastase inhibitors from the reactive centre loop of alpha1-antitrypsin. Bioorg Med Chem Lett10:1219-21 (2000) Chymotrypsin-like elastase family member 2A
Name:Chymotrypsin-like elastase family member 2A
Type:PROTEIN
Mol. Mass.:28705.23
Organism:Sus scrofa
Description:ChEMBL_156951
Residue:269
BDBM50089094
NameBDBM50089094
Synonyms:CHEMBL414810 | Met-Phe-Leu-Glu-Ala-Ile-Pro-Met-Ser
TypeSmall organic molecule
Emp. Form.C47H75N9O13S2
Mol. Mass.1038.281
SMILESCC[C@@H](C)[C@@H](NC(=O)[C@@H](C)NC(=O)[C@@H](CCC(O)=O)NC(=O)[C@@H](CC(C)C)NC(=O)[C@@H](Cc1ccccc1)NC(=O)[C@H](N)CCSC)C(=O)N1CCC[C@H]1C(=O)N[C@@H](CCSC)C(=O)N[C@@H](CO)C(O)=O