Reaction Details
TargetB2 bradykinin receptor
LigandBDBM50089308
Substrate/Competitorn/a
Meas. Tech.ChEMBL_40428 (CHEMBL652643)
Ki 0.08±n/a nM
Citation Amblard, MBedos, POlivier, CDaffix, ILuccarini, JMDodey, PPruneau, DPaquet, JLMartinez, J Synthesis and biological evaluation of bradykinin B(1)/B(2) and selective B(1) receptor antagonists. J Med Chem43:2382-6 (2000) B2 bradykinin receptor
Name:B2 bradykinin receptor
Type:Enzyme Catalytic Domain
Mol. Mass.:44467.17
Organism:Homo sapiens (Human)
Description:B2 BRADYKININ BDKRB2 HUMAN::P30411
Residue:391
BDBM50089308
NameBDBM50089308
Synonyms:CHEMBL412349 | H-DArg-Arg-Pro-Hyp-Gly-Thi-Ser-DTic-Oic-Arg-OH( HOE140)
TypeSmall organic molecule
Emp. Form.C59H83N19O13S
Mol. Mass.1298.475
SMILESNC(CCCNC(N)=N)C(=O)N[C@H](CCCNC(N)=N)C(=O)N1CCC[C@H]1C(=O)N1CC(O)C[C@H]1C(=O)NCC(=O)NC(Cc1cccs1)C(=O)N[C@@H](CO)C(=O)N1Cc2ccccc2CC1C(=O)N1C(Cc2ccccc12)C(=O)NC(CCCNC(N)=N)C(O)=O