Reaction Details
TargetSubstance-P receptor
LigandBDBM50106901
Substrate/Competitorn/a
Meas. Tech.ChEBML_205390
IC50 0.500000±n/a nM
Citation Gerspacher, Mvon Sprecher, AMah, RAnderson, GPBertrand, CSubramanian, NHauser, KBall, HA N-[(R,R)-(E)-1-(4-chloro-benzyl)-3-(2-oxo-azepan-3-ylcarbamoyl)-allyl]-N-methyl-3,5-bis-trifluoromethyl-benzamide: an orally active neurokinin NK1/NK2 antagonist. Bioorg Med Chem Lett10:1467-70 (2000) Substance-P receptor
Name:Substance-P receptor
Type:G Protein-Coupled Receptor (GPCR)
Mol. Mass.:46254.43
Organism:Homo sapiens (Human)
Description:P25103
Residue:407
BDBM50106901
NameBDBM50106901
Synonyms:CHEMBL104954 | N-[(E)-(R)-1-(4-Chloro-benzyl)-3-((R)-2-oxo-azepan-3-ylcarbamoyl)-allyl]-N-methyl-3,5-bis-trifluoromethyl-benzamide
TypeSmall organic molecule
Emp. Form.C27H26ClF6N3O3
Mol. Mass.589.957
SMILESCN([C@H](Cc1ccc(Cl)cc1)\C=C\C(=O)N[C@@H]1CCCCNC1=O)C(=O)c1cc(cc(c1)C(F)(F)F)C(F)(F)F